acidente ferroviário
type: Concept
preferred label: railway accident @en-gb
preferred label: Bahnunglück @de
preferred label: Ferroviari @it
preferred label: accidentes ferroviarios @es
preferred label: 鉄道事故 @ja-jp
preferred label: Accident de chemin de fer @fr
definition: Accidents involving trains. @en-gb
definition: Acidente envolvendo trens.
definition: 列車関連事故 @ja-jp
definition: Unfälle mit Zügen. @de
definition: Accident mettant en cause des trains @fr
definition: Incidenti su reti ferroviarie @it
definition: Acidente envolvendo comboios.
definition: Accidentes que involucran trenes @es
note: nessuno @it
in scheme: subjectcode
created: 2000-10-30T12:00:00+00:00
modified: 2010-12-15T17:01:09+00:00
broader: http://cv.iptc.org/newscodes/subjectcode/03010000