Aerei e spaziali
type: Concept
preferred label: accidentes aéreos y espaciales @es
preferred label: Flugunglück @de
preferred label: Accident dans l'air et l'espace @fr
preferred label: acidente aéreo @pt-pt
preferred label: air and space accident @en-gb
preferred label: 航空・宇宙事故 @ja-jp
definition: Acidente envolvendo aviões ou naves espaciais. @pt-pt
definition: 空あるいは宇宙における航空機関連事故 @ja-jp
definition: Accident aérien ou spatial @fr
definition: Accidentes que involucran naves aéreas o espaciales @es
definition: Unfälle mit Fahrzeugen im Luft- oder Weltraum. @de
definition: Incidenti di mezzi aerei o spaziali
definition: Accidents involving craft in air or space. @en-gb
note: nessuno
in scheme: subjectcode
created: 2000-10-30T12:00:00+00:00
modified: 2010-12-15T17:01:09+00:00
broader: http://cv.iptc.org/newscodes/subjectcode/03010000