Eruzione
type: Concept
preferred label: volcanic eruption @en-gb
preferred label: Vulkanausbruch @de
preferred label: erupção vulcânica @pt-br
preferred label: erupción volcánica @es
preferred label: 火山噴火 @ja-jp
preferred label: éruption volcanique @fr
definition: Ruptura da crosta terrestre que permite a emissão de material derretido para a superfície. @pt-br
definition: Emissione di lava o altri materiali da un vulcano o da altre fratture nella crosta terrestre
definition: A rupture in the skin of the Earth allowing molten material to escape to the surface @en-gb
definition: 地表にできた裂け目を通じて、融解した物質が表面に漏れること @ja-jp
definition: La ruptura de la corteza terrestre que permite el escape de material derretido hacia la superficie. @es
definition: Bruch in der Erdkruste, aus dem geschmolzenes Material an der Oberfläche ausgeworfen wird. @de
definition: Projections plus ou moins violentes de diverses matières par un volcan @fr
definition: Rutura da crosta terrestre que permite a emissão de material derretido para a superfície. @pt-pt
note: nessuno
in scheme: subjectcode
created: 2000-10-30T12:00:00+00:00
modified: 2010-12-15T17:01:09+00:00
broader: http://cv.iptc.org/newscodes/subjectcode/03000000