Emergenza
type: Concept
preferred label: caso de emergência @pt-br
preferred label: Situation d'urgence @fr
preferred label: incidentes de emergencia @es
preferred label: Notfall @de
preferred label: emergency incident @en-gb
preferred label: 緊急事態 @ja-jp
definition: 即座の対応を必要とする突然で予期しない出来事 @ja-jp
definition: Ein plötzliches, unerwartetes Ereignis, was eine sofortige Reaktion erfordert. @de
definition: A sudden, unexpected event that requires immediate action @en-gb
definition: Evénement imprévu et soudain demandant une action urgente et immédiate @fr
definition: Evento súbito, inesperado que requer ação imediata. @pt-pt
definition: Un hecho súbito, inesperado que requiere atención inmediata. @es
definition: Evento improvviso e inaspettato che richiede un intervento urgente ed immediato
note: nessuno
in scheme: subjectcode
created: 2000-10-30T12:00:00+00:00
modified: 2010-12-15T17:01:09+00:00
broader: http://cv.iptc.org/newscodes/subjectcode/03000000
narrower: http://cv.iptc.org/newscodes/subjectcode/03014001