desastre (geral)
type: Concept
preferred label: catástrofes (general) @es
preferred label: Katastrophe @de
preferred label: Disastri (generico) @it
preferred label: 災害（一般） @ja-jp
preferred label: Désastre @fr
preferred label: disaster (general) @en-gb
definition: Gravi o improvvise sciagure, Catastrofi @it
definition: Azar sério ou súbito.
definition: Desgracias serias o súbitas. @es
definition: 重大なあるいは不意な災難 @ja-jp
definition: Serious or sudden misfortune @en-gb
definition: Tous les désastres sérieux et soudains @fr
definition: Ernsthaftes und plötzliches Unglück. @de
definition: Desgraça imprevista e grave.
note: nessuno @it
in scheme: subjectcode
created: 2000-10-30T12:00:00+00:00
modified: 2010-12-15T17:01:09+00:00
broader: http://cv.iptc.org/newscodes/subjectcode/03000000
narrower: http://cv.iptc.org/newscodes/subjectcode/03015001
narrower: http://cv.iptc.org/newscodes/subjectcode/03015002