Frane, Valanghe
type: Concept
preferred label: avalanche/deslizamento de terra @pt-br
preferred label: avalancha/alud @es
preferred label: avalanche/aluimento de terras @pt-pt
preferred label: 雪崩・地滑り @ja-jp
preferred label: Avalanche/Glissement de terrain @fr
preferred label: avalanche/landslide @en-gb
preferred label: Lawine/Erdrutsch @de
definition: Plötzliches Verrutschen von großen Schnee- oder Erdmassen. @de
definition: Deslocamento súbito de grandes massas de neve ou terra. @pt-pt
definition: Eboulement soudain du sol ou d'une grande quantité de neige @fr
definition: Sudden dislodging of massive amounts of snow or soil. @en-gb
definition: Movimientos imprevistos de masas de nieve o tierra. @es
definition: 大量の雪や土壌が突然移動すること @ja-jp
definition: Cedimenti improvvisi con conseguenti dislocazioni di grandi masse di terra o sassi o neve; Slavine
note: nessuno
in scheme: subjectcode
created: 2004-10-13T12:00:00+00:00
modified: 2012-07-10T12:00:00+00:00
broader: http://cv.iptc.org/newscodes/subjectcode/03015000