Piani Emergenza
type: Concept
preferred label: planificación de emergencia @es
preferred label: Katastrophenschutz @de
preferred label: emergency planning @en-gb
preferred label: planos de emergência @pt-br
preferred label: 災害対策 @ja-jp
preferred label: Prévention et organisation des secours @fr
definition: Planning for actions to deal with sudden, unplanned events @en-gb
definition: Planos de ação para lidar com eventos súbitos e inesperados. @pt-pt
definition: Attività di prevenzione e di pianificazione per affrontare eventi improvvisi e non programmati
definition: 不意で、予期せぬ出来事に対処するための行動を計画すること @ja-jp
definition: Plans d'interventions d'urgence @fr
definition: Vorbereitung auf Aktionen, um mit unvorhergesehenen Ereignissen umgehen zu können. @de
definition: La planificación de acciones para lidiar contra eventos súbitos o no planeados. @es
note: nessuno
in scheme: subjectcode
created: 2000-10-30T12:00:00+00:00
modified: 2010-12-15T17:01:09+00:00
broader: http://cv.iptc.org/newscodes/subjectcode/03000000