Salvataggio
type: Concept
preferred label: 救助活動 @ja-jp
preferred label: Rettung @de
preferred label: salvamento / busca @pt-pt
preferred label: rescue @en-gb
definition: 人間や動物、財産を被害や危険から守るための活動 @ja-jp
definition: Operazione condotta per mettere in salvo persone, animali o proprietà da un danno o un pericolo
definition: Operação para salvar pessoas, animais ou propriedade de dano ou perigo. @pt-br
definition: Aktion um Menschen, Tiere oder Eigentum vor Verletzung oder Gefahr zu schützen. @de
definition: An operation to save people, animals or property from harm or danger. @en-gb
note: nessuno
in scheme: subjectcode
created: 2006-08-21T12:00:00+00:00
modified: 2012-07-10T12:00:00+00:00
broad match: http://cv.iptc.org/newscodes/mediatopic/20000168
broader: http://cv.iptc.org/newscodes/subjectcode/03000000