Coltivazioni
type: Concept
preferred label: agricultura @pt-br
preferred label: Cultures @fr
preferred label: Ackerbau @de
preferred label: arable farming @en-gb
preferred label: cultivos agrícolas @es
preferred label: 農業 @ja-jp
definition: Produção de alimentos no solo. @pt-pt
definition: 土地を使った食糧生産 @ja-jp
definition: Production of food in the ground @en-gb
definition: Gewinnung von Nahrungsmittel aus dem Boden. @de
definition: Producción de alimentos en la tierra. @es
definition: Travail de la terre, exploitation du milieu naturel @fr
definition: Lavorazione della terra affinché essa diventi produttiva e dia frutti per il consumo
note: nessuno
in scheme: subjectcode
created: 2000-10-30T12:00:00+00:00
modified: 2010-12-15T17:01:09+00:00
broader: http://cv.iptc.org/newscodes/subjectcode/04001000