Industria ittica
type: Concept
preferred label: Fischindustrie @de
preferred label: pescas @pt-pt
preferred label: fishing industry @en-gb
preferred label: Pêche @fr
preferred label: 水産 @ja-jp
preferred label: industria pesquera @es
definition: Raising or gathering of fish @en-gb
definition: 魚介類の養殖または捕獲 @ja-jp
definition: Cultivar o reunir el producto de la pesca. @es
definition: Criação ou recolha de peixe. @pt-br
definition: Industrie de l'élevage et de la transformation des produits de la pêche @fr
definition: Züchten und Fangen von Fisch. @de
definition: Pesca o allevamento di pesce
note: nessuno
in scheme: subjectcode
created: 2000-10-30T12:00:00+00:00
modified: 2010-12-15T17:01:09+00:00
broader: http://cv.iptc.org/newscodes/subjectcode/04001000