Allevamento
type: Concept
preferred label: pecuária @pt-br
preferred label: élevage @fr
preferred label: Tierhaltung @de
preferred label: ganadería @es
preferred label: livestock farming @en-gb
preferred label: 畜産 @ja-jp
definition: Criação de animais para consumo alimentar. @pt-pt
definition: 食糧用の動物の飼育 @ja-jp
definition: Cultivación de animales para el consumo. @es
definition: Raising of animals for food @en-gb
definition: Elevage fermier destiné à la consommation @fr
definition: Züchtung von Tieren als Nahrungsmittel. @de
definition: Riproduzione e allevamento degli animali destinati al consumo
note: nessuno
in scheme: subjectcode
created: 2000-10-30T12:00:00+00:00
modified: 2010-12-15T17:01:09+00:00
broader: http://cv.iptc.org/newscodes/subjectcode/04001000