Biotecnologia
type: Concept
preferred label: Biotechnologie @de
preferred label: biotecnologia @pt-pt
preferred label: biotecnología @es
preferred label: biotechnology @en-gb
preferred label: バイオテクノロジー @ja-jp
definition: Tätigkeiten, die Technologien verwenden, um Probleme und Lösungen von lebenden Organismen zu erforschen. @de
definition: La ciencia que utiliza tecnología ingenieril para estudiar y resolver los problemas de los organizmos vivientes. @es
definition: 生有機体の問題を研究したり、解決した工学技術を用いるビジネス @ja-jp
definition: Uso de engenharia tecnológica para estudar e resolver problemas dos organismos vivos. @pt-br
definition: Ensemble des procédés et techniques utilisant des processus biologiques à des fins industrielles @fr
definition: Insieme dei procedimenti e delle tecniche utilizzati nei processi biologici
definition: The business of using engineering technology to study and solved problems of living organisms @en-gb
note: nessuno
in scheme: subjectcode
created: 2000-10-30T12:00:00+00:00
modified: 2010-12-15T17:01:09+00:00
broader: http://cv.iptc.org/newscodes/subjectcode/04002000