Industria Farmaceutica
type: Concept
preferred label: indústria farmacêutica @pt-br
preferred label: pharmaceutical @en-gb
preferred label: productos farmacéuticos @es
preferred label: Pharmacie @fr
preferred label: Pharmaindustrie @de
preferred label: 製薬・薬品 @ja-jp
definition: Produzione di medicine a base di prodotti chimici e/o naturali
definition: The production of medicines from various chemicals and natural substances @en-gb
definition: さまざまな化学物質と天然の物質からの医薬品製造 @ja-jp
definition: Produção de medicamentos a partir de substâncias químicas ou naturais. @pt-pt
definition: la creación de medicinas a base de varios químicos y sustancias naturales. @es
definition: Die Herstellung von Medizin aus verschiedenen Chemikalien und natürlichen Stoffen. @de
definition: Production de médicaments à partir de substances naturelles ou chimiques @fr
note: nessuno
in scheme: subjectcode
created: 2000-10-30T12:00:00+00:00
modified: 2010-12-15T17:01:09+00:00
broader: http://cv.iptc.org/newscodes/subjectcode/04002000