Informatica e Telecomunicazioni
type: Concept
preferred label: Computer und Informationstechnologie @de
preferred label: ＩＴ産業 @ja-jp
preferred label: computing and information technology @en-gb
preferred label: computación e informática @es
preferred label: tecnologias de informação @pt-br
preferred label: Informatique et technologie de l'information @fr
definition: Anything to do with the computing and/or transmission of information from one point to another. @en-gb
definition: Quanto concerne con l'elaborazione e il trattamento tecnologico dei dati e con la trasmissione delle informazioni
definition: コンピュータ処理および(または)通信で行われる情報転送 @ja-jp
definition: Tout ce qui concerne les ordinateurs et la transmission de l'information d'un point à un autre @fr
definition: Tudo o que diz respeito à computação e à transmissão de informação de um ponto para outro. @pt-br
definition: Cualquier cosa que tenga que ver con computación y/o transmisión de información de un punto a otro. @es
definition: Alles was die elektronische Verarbeitung und Übertragung von Information von einem Punkt zu einem anderen. @de
note: nessuno
in scheme: subjectcode
created: 2000-10-30T12:00:00+00:00
modified: 2010-12-15T17:01:09+00:00
broader: http://cv.iptc.org/newscodes/subjectcode/04000000
narrower: http://cv.iptc.org/newscodes/subjectcode/04003001
narrower: http://cv.iptc.org/newscodes/subjectcode/04003002
narrower: http://cv.iptc.org/newscodes/subjectcode/04003003
narrower: http://cv.iptc.org/newscodes/subjectcode/04003004
narrower: http://cv.iptc.org/newscodes/subjectcode/04003005
narrower: http://cv.iptc.org/newscodes/subjectcode/04003006
narrower: http://cv.iptc.org/newscodes/subjectcode/04003007
narrower: http://cv.iptc.org/newscodes/subjectcode/04003008
narrower: http://cv.iptc.org/newscodes/subjectcode/04003009