Reti e Connessioni
type: Concept
preferred label: Réseaux et télécommunications @fr
preferred label: networking @en-gb
preferred label: ligação em rede @pt-pt
preferred label: Netzwerk @de
preferred label: ネットワーク @ja-jp
preferred label: conexão em rede @pt-br
preferred label: interconexión @es
definition: Interconexão entre os componentes de hardware que estabelece um meio de transmissão de dados. @pt-pt
definition: La interconección entre hardwares que provee elmedio por el cual se transmiten datos. @es
definition: データの転送のための手段を提供するハードウェア間の相互接続 @ja-jp
definition: Interconnexion entre les équipements pour la transmission de données @fr
definition: Verbindung zwischen Computern, die den Austausch von Daten ermöglichen. @de
definition: Collegamenti che permettono la trasmissione dei dati e/o informazioni fra diversi apparati
definition: The interconnectivity between hardware that provides the medium for the transmission of data. @en-gb
note: nessuno
in scheme: subjectcode
created: 2000-10-30T12:00:00+00:00
modified: 2010-12-15T17:01:09+00:00
broader: http://cv.iptc.org/newscodes/subjectcode/04003000