Sistemi Telecomunicazione
type: Concept
preferred label: Telekommunikationsinstallation @de
preferred label: équipement de télécommunication @fr
preferred label: telecomunicações (equipamentos) @pt-br
preferred label: equipos de telecomunicaciones @es
preferred label: 通信機器 @ja-jp
preferred label: telecommunication equipment @en-gb
definition: Dispositivi e apparati per le trasmissioni di voce/dati da un punto ad un altro
definition: Equipement de télécommunications comme les téléphones et les modems @fr
definition: Aparatos tales com teléfonos, voz/datos intercambiadores, modems, etc,que facilitan la transmision voz-datos de un punto a otro. @es
definition: Aparelhos como telefones, comutadores de integração voz/dados, modems, etc., que facilitam a transmissão voz-dados de um ponto para outro. @pt-br
definition: Devices such as telephone sets, voice/data switches, modems etc that facilitate point-to-point voice/data transmissions @en-gb
definition: Geräte wie Telefonanlagen, Modems, Fax etc. die den Austausch von Sprache/Daten erleichtern. @de
definition: Aparelhos como telefones, comutadores de integração voz/dados, modems, etc., que facilitam a transmissão voz/dados de um ponto para outro. @pt-pt
definition: 電話機、音声やデータの交換機、モデムなど、音声やデータ伝送を容易にするような機器 @ja-jp
note: nessuno
in scheme: subjectcode
created: 2000-10-30T12:00:00+00:00
modified: 2010-12-15T17:01:09+00:00
broader: http://cv.iptc.org/newscodes/subjectcode/04003000