Servizi Telecomunicazione
type: Concept
preferred label: 通信事業 @ja-jp
preferred label: servicio de telecomunicaciones @es
preferred label: Telekommunikationsdienst @de
preferred label: telecomunicações @pt-br
preferred label: telecommunication service @en-gb
preferred label: Services télécoms @fr
definition: Dienstleistung, die von kommerziellen Firmen angeboten wird, die die Verbindung zwischen Telefonen, Fax und Computern erleichtern. @de
definition: Servizi forniti da compagnie per le connessioni tra dispositivi di telecomunicazione
definition: Services provided by commercial companies that facilitate connections between telephones, pagers, computers @en-gb
definition: Serviços fornecidos por empresas que facilitam ligações entre telefones, pagers ou computadores. @pt-pt
definition: Servicios provistos por compañias comerciales para facilitar las conecciones entre teléfonos, buscapersonas y compoutadores. @es
definition: Services de télécommunications fournis par des compagnies commerciales @fr
definition: 電話、ポケベル、コンピュータ間の接続を容易にする商事会社によって提供されるサービス @ja-jp
note: nessuno
note: typo fixed in Explanation @en-gb
in scheme: subjectcode
created: 2000-10-30T12:00:00+00:00
modified: 2010-12-15T17:01:09+00:00
broader: http://cv.iptc.org/newscodes/subjectcode/04003000