tecnologia sem fios
type: Concept
preferred label: 無線通信 @ja-jp
preferred label: wireless technology @en-gb
preferred label: tecnologia inalambrica @es
preferred label: Drahtlose Technologie @de
preferred label: Tecnologia wireless @it
preferred label: Technologie sans-fil @fr
preferred label: tecnologia sem fio
definition: Transmissão de informação sem utilizar fios ou cabos conectados.
definition: Austausch von Informationen mit Mitteln außerhalb der direkten verdrahteten Schaltung. @de
definition: Transmission d'information sans utiliser de fil ou de cable @fr
definition: Transmission of information through means other than point-to-point wired hookups @en-gb
definition: 地点間をケーブルで接続する以外の手段で情報を送信すること @ja-jp
definition: Tecnologie e trasmissione dati da un punto ad un altro con mezzi diversi dalle connessioni via cavo @it
definition: Transmisión de información a través de otros medios que no sean mediante cables conectados. @es
note: nessuno @it
in scheme: subjectcode
created: 2004-10-13T12:00:00+00:00
modified: 2012-07-10T12:00:00+00:00
broader: http://cv.iptc.org/newscodes/subjectcode/04003000