Travaux Publics
type: Concept
preferred label: Tiefbau @de
preferred label: Grandi Opere @it
preferred label: construcción pesada @es
preferred label: heavy construction @en-gb
preferred label: 大規模建設 @ja-jp
preferred label: obras públicas @pt-pt
definition: Projetos de construção de grande escala: estradas, barragens, edifícios de escritórios, fábricas, estádios, etc. @pt-pt
definition: Bau von Straßen, Dämmen, Büro- und anderen Großbauten. @de
definition: Progetti e costruzioni su larga scala di impianti e/o strutture; Lavori Pubblici @it
definition: Industrie du bâtiment et des travaux publics
definition: Large scale construction projects, construction of roads, dams, office/factory buildings, offshore and onshore structures, large sport stadiums @en-gb
definition: Proyectos de construcción a gran escala: caminos, represas, edificios de oficinas o fábricas dentro o fuera de la costa. @es
definition: Projetos de construção de grande escala: estradas, represas, edifícios de escritórios, fábricas, estádios, etc. @pt-br
definition: 道路やダム、事務所/工場の建物、沖合いや沿岸の建造物、巨大なスポーツスタジアムのような、大規模な建設プロジェクト @ja-jp
note: nessuno @it
note: Explanation changed in V 15
in scheme: subjectcode
created: 2000-10-30T12:00:00+00:00
modified: 2010-12-15T17:01:09+00:00
broader: http://cv.iptc.org/newscodes/subjectcode/04004000