Progettazione, Ingegneria
type: Concept
preferred label: design and engineering @en-gb
preferred label: Design und Technik @de
preferred label: Design et ingénierie @fr
preferred label: design e engenharia @pt-pt
preferred label: deseño e ingeniería @es
preferred label: 土木 @ja-jp
definition: Concepção e planejamento, por engenheiros, arquitetos, de estradas, escritórios, fábricas, represas, etc. @pt-br
definition: Conceção e planeamento, por engenheiros e arquitetos, de estradas, escritórios, fábricas, barragens, etc. @pt-pt
definition: 道路、オフィス、工場、ダム、海洋構造物をエンジニア、建築家などによって設計および計画すること @ja-jp
definition: Progetti di strutture e/o infrastrutture
definition: Deseño y planeamiento hecho por Ingenieros, Arquitectos, etc., de caminos, oficinas, fábricas, represas u estructuras mas adentro. @es
definition: Design und Planung durch Ingenieure, Architekten etc. von Straßen, Büros, Fabriken, Dämmen, Bauwerken in Gewässern. @de
definition: Conception et ingénierie des ponts, chaussées, bâtiments @fr
definition: Design and planning by Engineers, Architects etc. of roads, offices, factories, dams , offshore structures, @en-gb
note: nessuno
in scheme: subjectcode
created: 2004-10-13T12:00:00+00:00
modified: 2012-07-10T12:00:00+00:00
broader: http://cv.iptc.org/newscodes/subjectcode/04004000