Energie alternative
type: Concept
preferred label: alternative energy @en-gb
preferred label: energias alternativas @pt-br
preferred label: 代替エネルギー @ja-jp
preferred label: énergies alternatives @fr
preferred label: Alternativ-Energien @de
preferred label: energía alternativa @es
definition: Das Geschäft mit Alternativen-Energien. @de
definition: Les sources d'énergie de remplacement, énergies alternatives @fr
definition: Risorse energetiche alternative
definition: Histórias sobre o negócio das energias alternativas. @pt-br
definition: Alternative energy business @en-gb
definition: 代替エネルギービジネスに関する話 @ja-jp
definition: Historias de negocios en energía alternativa @es
note: nessuno
in scheme: subjectcode
created: 2000-10-30T12:00:00+00:00
modified: 2010-12-15T17:01:09+00:00
broader: http://cv.iptc.org/newscodes/subjectcode/04005000