Carbone
type: Concept
preferred label: coal @en-gb
preferred label: Charbon @fr
preferred label: Kohle @de
preferred label: carvão @pt-br
preferred label: 石炭 @ja-jp
preferred label: carbón @es
definition: L'exploitation de charbon et de schistes bitumineux pour la production d'énergie @fr
definition: Produção e extração de antracite e de produtos betuminosos para usar na produção de energia. @pt-br
definition: Producción y extracción de productos de carbón y betún utilizados para la protección de energía. @es
definition: Production and mining of anthracite and bituminous products for use in power production @en-gb
definition: 電力生産のために使用する無煙炭やれき青質製品の産出や採鉱 @ja-jp
definition: Herstellung und Förderung von Glanz- und Steinkohle zur Energieerzeugung. @de
definition: Processi di produzione ed estrazione di carbone e prodotti bituminosi usati nella produzione di energia
note: nessuno
in scheme: subjectcode
created: 2000-10-30T12:00:00+00:00
modified: 2010-12-15T17:01:09+00:00
broader: http://cv.iptc.org/newscodes/subjectcode/04005000