Energia nucleare
type: Concept
preferred label: energia nuclear @pt-br
preferred label: energía nuclear @es
preferred label: 原子力 @ja-jp
preferred label: nuclear power @en-gb
preferred label: énergie nucléaire @fr
preferred label: Atomenergie @de
definition: Uso de materiais radioativos na produção de energia. @pt-br
definition: L'énergie produite par fission nucléaire @fr
definition: 電力生産のために放射性物質を使用すること @ja-jp
definition: Nutzung von radioaktivem Material zur Energiegewinnung. @de
definition: Use of radioactive materials for power production @en-gb
definition: Attività riguardanti la produzione di energia attraverso la fissione nucleare
definition: Uso de materiales radioactivos para la procucción de energía. @es
note: nessuno
in scheme: subjectcode
created: 2000-10-30T12:00:00+00:00
modified: 2010-12-15T17:01:09+00:00
broader: http://cv.iptc.org/newscodes/subjectcode/04005000