Risorse naturali (generico)
type: Concept
preferred label: Ressources naturelles @fr
preferred label: Rohstoff @de
preferred label: recursos naturais (geral) @pt-pt
preferred label: natural resources (general) @en-gb
preferred label: recursos naturales (general) @es
preferred label: 天然資源（一般） @ja-jp
definition: Artigos sobre o uso geral de recursos naturais para fins comerciais. @pt-br
definition: Die generelle Nutzung natürlicher Ressourcen zu wirtschaftlichen Zwecken, mit Ausnahme von einem bestimmten Bereich, wie Kohle, Öl, Gas oder Wasser. @de
definition: The general use of natural resources for business purposes, not focused on specific resources such as coal, oil, gas or water @en-gb
definition: Artículos acerca del uso general de recursos naturales con propósito empresarial, no focalizado en recursos específicos como carbón, petróleo, gas o agua. @es
definition: Generico utilizzo a fini economici o imprenditoriali delle risorse natuali
definition: L'utilisation des ressources naturelles en général @fr
definition: 石炭、石油、天然ガスあるいは水のような特定資源に焦点をあてない商業目的での天然資源の一般使用に関する記事 @ja-jp
note: nessuno
in scheme: subjectcode
created: 2000-10-30T12:00:00+00:00
modified: 2010-12-15T17:01:09+00:00
broader: http://cv.iptc.org/newscodes/subjectcode/04005000
broad match: http://cv.iptc.org/newscodes/mediatopic/20000256