Gas naturali
type: Concept
preferred label: gas natural @es
preferred label: gás natural @pt-pt
preferred label: natural gas @en-gb
preferred label: Erdgas @de
preferred label: Gaz naturel @fr
preferred label: 天然ガス @ja-jp
definition: Natürlicher Rohstoff aus der Erde, meist Methan in entflammbarem gasförmigen Zustand. @de
definition: A natural resource, mainly methane in an flammable gaseous state, from the ground @en-gb
definition: Recurso natural, sobretudo metano em estado gasoso inflamável. @pt-br
definition: Ressource naturelle, principalement du méthane inflammable, extraite de gisements @fr
definition: Un recurso natural, principalmente metano en un estado gaseoso inflamable, obtenido de la tierra. @es
definition: Tutte le attività concernenti i gas estratti dalla terra, principalmente il metano
definition: 地中から採取する天然資源。主に燃えやす状態のメタンガス @ja-jp
note: nessuno
in scheme: subjectcode
created: 2004-04-22T12:00:00+00:00
modified: 2012-07-10T12:00:00+00:00
broader: http://cv.iptc.org/newscodes/subjectcode/04005000