gasóleo
type: Concept
preferred label: Diesel @de
preferred label: combustible diesel @es
preferred label: Carburant diesel @fr
preferred label: diesel fuel @en-gb
preferred label: ディーゼル燃料 @ja-jp
preferred label: Gasolio @it
definition: トラック、マリン・エンジンで使用されるだけでなく、ある種の家庭暖房用製品でも使用される、ガソリンより重い蒸留された石油製品 @ja-jp
definition: Produto petrolífero destilado, mais pesado do que a gasolina, utilizado para camiões, motores de barcos e certos sistemas de calefação.
definition: Produit pétrolier plus lourd que l'essence utilisé comme carburant et dans le chauffage @fr
definition: Produto petrolífero destilado, mais pesado do que a gasolina, utilizado para caminhões, motores de barcos e certos sistemas de calefação.
definition: Destilliertes Petroleumprodukt schwerer als Benzin nicht nur für LKW`s, Seemotoren, sondern auch in spezieller Form zum Heizen. @de
definition: Derivato del petrolio utilizzato non soltanto come carburante ma anche per alimentazione di impianti (ad es. riscaldamento) @it
definition: A distilled petroleum product heavier than gasoline used not only for trucks, marine engines, but in certain forms for home heating @en-gb
definition: Un producto destilado del petróleo, más grueso que la gasolina, utilizado no sólo para camiones y motores de barcos, pero en ciertos sistemas de calefacción de edificios. @es
note: nessuno @it
in scheme: subjectcode
created: 2004-04-22T12:00:00+00:00
modified: 2012-07-10T12:00:00+00:00
broader: http://cv.iptc.org/newscodes/subjectcode/04005000