Agenzie per l'impiego
type: Concept
preferred label: agencias de empleo @es
preferred label: Arbeitsvermittlung @de
preferred label: trabalho temporário (agências) @pt-pt
preferred label: employment agency @en-gb
preferred label: Agence pour l'emploi @fr
preferred label: 人材派遣 @ja-jp
definition: 人に仕事を斡旋したり会社に人材を派遣するサービス @ja-jp
definition: Serviço que ajuda as pessoas a encontrar emprego e as empresas a encontrar empregados. @pt-pt
definition: A service helping people find jobs, and companies to find workers @en-gb
definition: Lieu où sont répertoriés et proposés des emplois aux chômeurs @fr
definition: Dienst, der Menschen unterstützt einen Arbeitsplatz zu finden und für Firmen Arbeitskräfte vermittelt. @de
definition: Un servicio que ayuda a individuos a encontrar trabajos y a las companias a econtrar empleados. @es
definition: Servizi per aiutare le persone a trovare un lavoro e le imprese a reperire lavoratori
note: nessuno
in scheme: subjectcode
created: 2000-10-30T12:00:00+00:00
modified: 2010-12-15T17:01:09+00:00
broader: http://cv.iptc.org/newscodes/subjectcode/04006000