serviços jurídicos
type: Concept
preferred label: 法務 @ja-jp
preferred label: Servizi legali @it
preferred label: legal service @en-gb
preferred label: Rechtsberatung @de
preferred label: Service juridique @fr
preferred label: servicios legales @es
definition: Les cabinets et services juridiques @fr
definition: 会社や個人が州や連邦、地方の法に対処するのを手助けする弁護士など @ja-jp
definition: Advogados e outros que ajudam empresas e indivíduos a lidar com leis estatais, federais e locais.
definition: Advogados e outros que ajudam empresas e indivíduos a lidar com leis.
definition: Lawyers and others who help companies and individuals deal with state, federal and local laws @en-gb
definition: Abogados y otros que ayudan a compañias e individuos a ldiar con las leyes estatales, federales y locales. @es
definition: Rechtsanwälte und andere, die Firmen und Einzelnen dabei helfen mit staatlichen, bundesstaatlichen und örtlichen Gesetzen umzugehen. @de
definition: Avvocati e servizi di tipo giuridico di ausilio a società e altri soggetti nelle questioni riguardanti le leggi e normative statali, regionali e locali @it
note: nessuno @it
in scheme: subjectcode
created: 2000-10-30T12:00:00+00:00
modified: 2010-12-15T17:01:09+00:00
broader: http://cv.iptc.org/newscodes/subjectcode/04006000