Investimenti personali
type: Concept
preferred label: investimentos pessoais @pt-pt
preferred label: 個人投資 @ja-jp
preferred label: inversiones personales @es
preferred label: personal investing @en-gb
preferred label: Placements personnels @fr
preferred label: Private Investition @de
definition: Finanze ed investimenti personali
definition: 個人的な資産運用と投資 @ja-jp
definition: Finanças e investimentos pessoais. @pt-pt
definition: Finanzas e inversiones personales @es
definition: Les placements personnels @fr
definition: Private Finanzen und Investitionen. @de
definition: Personal finance and investment @en-gb
note: nessuno
in scheme: subjectcode
created: 2000-10-30T12:00:00+00:00
modified: 2010-12-15T17:01:09+00:00
broader: http://cv.iptc.org/newscodes/subjectcode/04006000