Servizi funebri
type: Concept
preferred label: agência funerária e crematório @pt-pt
preferred label: servicios funerarios y de crematorio @es
preferred label: funeral parlour and crematorium @en-gb
preferred label: 葬祭業 @ja-jp
preferred label: Beerdigungsinstitut @de
preferred label: Pompes funèbres @fr
definition: Compañías que ofrecen el servicio de eliminación de los restos @es
definition: 葬祭に関するサービスを提供する会社 @ja-jp
definition: Empresas que fornecem serviços funerários. @pt-pt
definition: Società e imprese di pompe funebri, servizi cimiteriali
definition: Sociétés de pompes funèbres, salons funéraires, crématoriums @fr
definition: Unternehmen, die Dienstleistungen anbieten im Zusammenhang mit Tod. @de
definition: Companies that provide services for disposal of the dead @en-gb
note: nessuno
in scheme: subjectcode
created: 2000-10-30T12:00:00+00:00
modified: 2010-12-15T17:01:09+00:00
broader: http://cv.iptc.org/newscodes/subjectcode/04006000