serviços de aluguer
type: Concept
preferred label: Sociétés de location @fr
preferred label: Mietservice @de
preferred label: rental service @en-gb
preferred label: servicios de arriendo @es
preferred label: serviços de locação
preferred label: レンタル業 @ja-jp
preferred label: Noleggi @it
definition: Empresas que fornecem serviços de locação, incluindo veículos, smokings, ferramentas, equipamento pesado e outros bens.
definition: Unternehmen, die Vermietungen anbieten, Fahrzeuge, Smokings, Werkzeuge, schwere Ausrüstung und andere Angebote. @de
definition: Società di noleggio di articoli e/o servizi di vario genere: auto, motoveicoli, vestiti, apparecchiature ecc. @it
definition: 賃貸商品を提供する会社。自動車、タキシード、道具、重機器、その他を含む @ja-jp
definition: Companies which provide rentals, including motor vehicles, tuxedos, tools, heavy equipment, and other supplies @en-gb
definition: Compañías de arrendamiento, incluyendo vehículos motores, herramientas, equipamiento pesado y otros insumos @es
definition: Empresas que fornecem serviços de aluguer, incluindo veículos, smokings, ferramentas, equipamento pesado e outros bens.
definition: Sociétés de location en tous genres @fr
note: nessuno @it
in scheme: subjectcode
created: 2000-10-30T12:00:00+00:00
modified: 2010-12-15T17:01:09+00:00
broader: http://cv.iptc.org/newscodes/subjectcode/04006000