serviços de casamento
type: Concept
preferred label: 結婚サービス @ja-jp
preferred label: servicios de boda @es
preferred label: Services matrimoniaux @fr
preferred label: wedding service @en-gb
preferred label: Hochzeitsservice @de
preferred label: Servizi matrimoniali @it
definition: Dienste und Produkte rund um die Hochzeit. @de
definition: Servizi e prodotti riguardanti l'industria delle nozze: vestiti, ristorazione, addobbi ed arredi, bomboniere ecc. @it
definition: Serviços e produtos relacionados com a indústria do casamento.
definition: 冠婚に関するサービスと製品 @ja-jp
definition: Services et produits spécialisés dans les mariages @fr
definition: Services and products related to the wedding industry @en-gb
definition: Servicios y productos relativos a la industria de los matrimonios @es
definition: Serviços e produtos relacionados à indústria do casamento.
note: nessuno @it
in scheme: subjectcode
created: 2000-10-30T12:00:00+00:00
modified: 2010-12-15T17:01:09+00:00
broader: http://cv.iptc.org/newscodes/subjectcode/04006000