Servizi Investimento
type: Concept
preferred label: servicio de inversiones @es
preferred label: investment service @en-gb
preferred label: Investmentdienst @de
preferred label: serviços de investimento @pt-br
preferred label: 投資顧問 @ja-jp
preferred label: Conseillers financiers @fr
definition: ストック･ディーラーやコンサルタントに対立するものとしての金融アドバイザー @ja-jp
definition: Servizi di consulenza finanziaria forniti a clienti
definition: Consejos financieros relativos a acciones, corredores de bolsa o consultores. @es
definition: Finanzberater, entgegen Börsenhändlern und -beratern. @de
definition: Conselheiros financeiros. @pt-pt
definition: Financial advisers, as opposed to stock dealers or consultants @en-gb
definition: Personnes qui conseillent des placements à leurs clients @fr
note: nessuno
in scheme: subjectcode
created: 2004-10-13T12:00:00+00:00
modified: 2012-07-10T12:00:00+00:00
broader: http://cv.iptc.org/newscodes/subjectcode/04006000