Alimenti
type: Concept
preferred label: 食品 @ja-jp
preferred label: food @en-gb
preferred label: Alimentation @fr
preferred label: alimentação @pt-br
preferred label: Nahrungsmittel @de
preferred label: alimentos procesados para la venta @es
definition: Frutas, vegetales, pan, carnes, etc, para el consumo humano. @es
definition: Fruta, vegetais, pães, carnes, etc. para consumo humano. @pt-pt
definition: Frutta, verdure, pane, carne per il consumo umano
definition: 人間が摂取すための果物や野菜、パン、肉 @ja-jp
definition: Fruits, vegetables, breads, meats for human consumption @en-gb
definition: Fruits, légumes, pains, viandes pour la consommation humaine @fr
definition: Früchte, Gemüse, Brot, Fleisch zum Verzehr für Menschen. @de
note: nessuno
in scheme: subjectcode
created: 2000-10-30T12:00:00+00:00
modified: 2010-12-15T17:01:09+00:00
broader: http://cv.iptc.org/newscodes/subjectcode/04007000