Bevande
type: Concept
preferred label: bebidas @es
preferred label: beverage @en-gb
preferred label: Getränke @de
preferred label: Distribution de boissons @fr
preferred label: 飲料 @ja-jp
definition: Consumíveis líquidos, alcoólicos e não alcoólicos. @pt-br
definition: Liquid consumables, both alcoholic and non-alcoholic @en-gb
definition: 液体消費財。アルコールを含む、含まないに関わらない @ja-jp
definition: Beni di consumo liquidi, sia alcolici sia analcolici
definition: Tout élément liquide, alcoolisé ou non, que l'on peut boire @fr
definition: Liquidos consumiblesñ ambos alcohólicos y no alcohólicos. @es
definition: Konsumierbare Getränke, alkoholische und nicht-alkoholische. @de
note: nessuno
in scheme: subjectcode
created: 2000-10-30T12:00:00+00:00
modified: 2010-12-15T17:01:09+00:00
broader: http://cv.iptc.org/newscodes/subjectcode/04007000