Giocattoli
type: Concept
preferred label: toy @en-gb
preferred label: juguete @es
preferred label: brinquedos @pt-br
preferred label: Jouets @fr
preferred label: Spielwaren @de
preferred label: 玩具 @ja-jp
definition: 子供のおもちゃ @ja-jp
definition: Objetos com os quais as crianças brincam. @pt-br
definition: Beni principalmente destinati al gioco dei bambini
definition: Spielzeug für Kinder. @de
definition: Cosas con las que juegan los niños. @es
definition: Objets avec lesquels jouent les enfants @fr
definition: Children's plaything @en-gb
note: nessuno
in scheme: subjectcode
created: 2004-10-13T12:00:00+00:00
modified: 2012-07-10T12:00:00+00:00
broader: http://cv.iptc.org/newscodes/subjectcode/04007000