Consumatori
type: Concept
preferred label: consumer issue @en-gb
preferred label: Consommation @fr
preferred label: problemas del consumidor @es
preferred label: consumo @pt-br
preferred label: Verbraucher/Konsument @de
preferred label: 消費者問題 @ja-jp
definition: Questioni come prezzi, inflazione/deflazione, qualità dei beni, considerate al livello di vendita al dettaglio
definition: 小売段階における、価格、インフレ・デフレ、商品の品質などに関する問題 @ja-jp
definition: Sachverhalte wie Preise, Inflation/Deflation, Warenqualität auf der Ebene des Einzelhandels. @de
definition: Assuntos como preços, inflação/deflação, qualidade dos bens, a nível da venda no varejo. @pt-br
definition: Assuntos como preços, inflação/deflação, qualidade dos bens, a nível da venda a retalho. @pt-pt
definition: Aquellos asuntos tales como precios, inflación/moderación, calidad de bienes, a niveles de ventas por menor. @es
definition: Those issues, such as prices, inflation/deflation, quality of goods, at the retail sales level @en-gb
definition: Tous les sujets relatifs à la consommation et aux consommateurs au niveau de la vente au détail @fr
note: nessuno
in scheme: subjectcode
created: 2000-10-30T12:00:00+00:00
modified: 2010-12-15T17:01:09+00:00
broader: http://cv.iptc.org/newscodes/subjectcode/04008000