Mercato emissioni obbligazionarie e titoli
type: Concept
preferred label: mercados de deuda @es
preferred label: mercado de dívida @pt-pt
preferred label: 債権市場 @ja-jp
preferred label: Kapitalmarkt @de
preferred label: Marché obligataire @fr
preferred label: debt market @en-gb
definition: Mercado para negociar instrumentos de dívida como obrigações, certificados de depósito, aprovações bancárias, obrigações do tesouro, notas, promissórias, etc. @pt-pt
definition: Markt für den Handel mit Schuldeninstrumentarien wie Wertpapiere, Banksicherheiten, Bargeld. @de
definition: 債券、CD(譲渡可能定期預金証書)、銀行引受手形、割引債、手形、IOU(借用証書)などの債務証券を売買する市場 @ja-jp
definition: Marchés pour négocier des obligations ou des bons @fr
definition: Market for trading debt instruments such as bonds, CDs, bankers acceptances, T bills, notes, IOUs etc @en-gb
definition: Mercado de intercambio para instrumentos de deuda tales como bonos, aprobaciones bancarias, depositos certificados, etc. @es
definition: Mercato riguardante strumenti di debito come obbligazioni, certificati di deposito, titoli obbligazionari a breve termine, Buoni del tesoro ecc.
note: nessuno
in scheme: subjectcode
created: 2000-10-30T12:00:00+00:00
modified: 2010-12-15T17:01:09+00:00
broader: http://cv.iptc.org/newscodes/subjectcode/04008000