Mercati emergenti
type: Concept
preferred label: Pays émergents @fr
preferred label: emerging market @en-gb
preferred label: mercados emergentes @es
preferred label: 新興国市場 @ja-jp
preferred label: Schulden/Schwellenland @de
definition: Mercados que lutam para entrar nas economias mundiais e aqueles que requerem ajuda financeira de credores internacionais. @pt-pt
definition: 世界経済に参加するように奮闘し、国際的な金融機関からの財政援助を必要とする市場 @ja-jp
definition: Aquellos mercados que luchan para entrar a las economias mundiales y aquellos que requieren de ayuda financiera de prestamistas internacionales. @es
definition: Mercati dei paesi in via di sviluppo che stanno sforzandosi per entrare nel sistema economico mondiale e di quelli che chiedono aiuti internazionali
definition: Die Märkte die kämpfen, um den weltweiten Wirtschaftsmarkt zu erreichen und die finanzielle Hilfe fordern von internationalen Kreditgebern. @de
definition: Those markets that are struggling to enter the world economies and those requiring financial help from international lenders @en-gb
definition: Pays en développement cherchant à entrer dans le commerce mondial et ceux ayant besoin de l'aide internationale @fr
note: nessuno
in scheme: subjectcode
created: 2000-10-30T12:00:00+00:00
modified: 2010-12-15T17:01:09+00:00
broader: http://cv.iptc.org/newscodes/subjectcode/04008000