Mercato Cambi
type: Concept
preferred label: mercado cambial @pt-br
preferred label: Marché des changes @fr
preferred label: mercados de divisas @es
preferred label: 為替 @ja-jp
preferred label: Devisenmarkt @de
preferred label: foreign exchange market @en-gb
definition: Marché des changes fixant la valeur des devises entre elles @fr
definition: Troca de divisas em todo o mundo, através de mercados regulados. @pt-br
definition: The trading of shekels, dinars, euros dollars etc around the world through regulated markets @en-gb
definition: Der Welthandel mit Schekel, Dinar, Euro, Dollar etc. auf geregelten Märkten. @de
definition: シュケル、ディナール、ユーロなど世界中のお金を、監督された資本市場を通して売買すること @ja-jp
definition: Operazioni sui cambi esteri che determinano ogni giorno il prezzo delle varie valute, ogni divisa rispetto all'altra
definition: El cambio de pesos, dinarios, euros, dólares, etc., alrededor del mundo a través de mercados regulados. @es
note: nessuno
in scheme: subjectcode
created: 2000-10-30T12:00:00+00:00
modified: 2010-12-15T17:01:09+00:00
broader: http://cv.iptc.org/newscodes/subjectcode/04008000