instituições econômicas internacionais
type: Concept
preferred label: instituições económicas internacionais
preferred label: international economic institution @en-gb
preferred label: Istituzioni economiche internazionali @it
preferred label: Institutions économiques internationales @fr
preferred label: instituciones económicas internacionales @es
preferred label: 国際経済機関 @ja-jp
preferred label: Internationale Wirtschaftsinstitution @de
definition: Institutions internationales telles que le PNUD, la Banque mondiale, l'OMC, etc. @fr
definition: Entidades como a Organização das Nações Unidas para o Desenvolvimento Industrial, o Banco Mundial, a Organização Mundial de Comércio, o Import-Export Bank, etc.
definition: Entities such as UNIDO, World Bank, World Trade Organization, the Import-Expert Bank etc that deals at a world level @en-gb
definition: Entidades tales como UNIDO, Banco Mundial, La Organización de Cambio Internacional, el banco Import'Export, etc,que realizan transaciones a nivel mundial. @es
definition: Organisationen wie die UNIDO, Weltbank, WTO, etc. die auf der ganzen Welt vertreten sind. @de
definition: Istituzioni internazionali quali Banca Mondiale, o WTO , operanti a livello mondiale @it
definition: 世界レベルで取引を行う、UNIDO(国際連合工業開発機関)、世界銀行、世界貿易機関や、輸入業務に精通した銀行などを指す @ja-jp
note: nessuno @it
in scheme: subjectcode
created: 2000-10-30T12:00:00+00:00
modified: 2010-12-15T17:01:09+00:00
broader: http://cv.iptc.org/newscodes/subjectcode/04008000