Inflazione, Deflazione
type: Concept
preferred label: インフレ・デフレ @ja-jp
preferred label: inflación y deflación @es
preferred label: Inflation und Deflation @de
preferred label: inflation and deflation @en-gb
preferred label: inflação @pt-pt
preferred label: Inflation et déflation @fr
definition: Aumento en la cantidad de dinero en circulación y por ende, genera laza en los precios. Deflación,: estrecha política monetaria que causa que los precios sean mas majos. @es
definition: An increase in the amount of money in circulation and thereby a rise in prices; deflation, tighter monetary policy causing lower prices @en-gb
definition: Die Zunahme der Geldmenge, die in Umlauf ist und die daraus resultierenden Preissteigerungen, Deflation, stärkere Geldwertpolitik, um die Preise zu senken. @de
definition: インフレーション：流通しているお金の量の増加と、それによる物価の上昇。デフレーション：物価下落を誘引している金融政策 @ja-jp
definition: *Aumento da quantidade de dinheiro em circulação e consequente subida de preços; deflação: política monetária mais estrita que provoca preços mais baixos.* @pt-pt
definition: Innalzamento o Abbassamento dei prezzi in conseguenza dell'aumento o meno della quantità di denaro in circolazione
definition: Hausse ou baisse des prix conséquence du montant élevé ou bas de l'argent en circulation @fr
note: nessuno
in scheme: subjectcode
created: 2003-04-05T12:00:00+00:00
modified: 2012-07-10T12:00:00+00:00
broader: http://cv.iptc.org/newscodes/subjectcode/04008000