Prezzi
type: Concept
preferred label: preços @pt-br
preferred label: Preis @de
preferred label: 物価 @ja-jp
preferred label: precios @es
preferred label: Prix @fr
preferred label: prices @en-gb
definition: Valor monetário de bens e serviços ou de ações e obrigações. @pt-pt
definition: Der Geldwert von Waren, Dienstleistungen oder festverzinslichen Wertpapiere und Aktien. @de
definition: Valor monetario de bienes, servicios, acciones y bonos. @es
definition: The monetary value of goods, services or stocks and bonds @en-gb
definition: La valeur d'un bien @fr
definition: 商品、サービスあるいは株式･債券の金額的価値 @ja-jp
definition: Valore di merci, servizi o titoli, espresso in termini monetari
note: nessuno
in scheme: subjectcode
created: 2003-04-05T12:00:00+00:00
modified: 2012-07-10T12:00:00+00:00
broader: http://cv.iptc.org/newscodes/subjectcode/04008000