Bilancio
type: Concept
preferred label: orçamento @pt-br
preferred label: budgets and budgeting @en-gb
preferred label: Haushaltsplan @de
preferred label: Budget @fr
preferred label: 予算 @ja-jp
preferred label: presupuestos @es
definition: prévision des recettes et dépenses @fr
definition: A method of balancing revenues against expenses @en-gb
definition: Método para medir ingresos y egresos contra los gastos. @es
definition: Methode das Gleichgewicht zwischen Einnahmen und Ausgaben auszubalancieren. @de
definition: 出費に対して収入のバランスをとるための方法 @ja-jp
definition: Método de equilibrar receitas e despesas. @pt-br
definition: Documento riguardante l'andamento di una società fra entrate ed uscite
note: nessuno
in scheme: subjectcode
created: 2003-04-05T12:00:00+00:00
modified: 2012-07-10T12:00:00+00:00
broader: http://cv.iptc.org/newscodes/subjectcode/04008000