Credito, Debito
type: Concept
preferred label: créditos e débitos @pt-pt
preferred label: crédito y débito @es
preferred label: 貸付・債務 @ja-jp
preferred label: Kredit- und Schuldensumme @de
preferred label: Crédit @fr
preferred label: credit and debt @en-gb
definition: Kredit: Geldhöhe, die jemandem zur Verfügung steht, meistens als Leihgabe. Schulden, Geldhöhe, die jemand schuldig ist. @de
definition: Credit: the amount of money available to you, often by loan. Debt, the amount you owe. @en-gb
definition: Crédito: Cantidad de dinero disponible para que Ud., casi siempre como préstamo. Deuda, cantidad que debe. @es
definition: Crédit : l'argent disponible, dette : l'argent dû @fr
definition: Il primo è la somma di denaro disponibile, il secondo è la somma dovuta
definition: Crédito: dinheiro disponível. Débito: dinheiro devido. @pt-br
definition: クレジット：ローン等によって、ある人が入手可能な金額。負債：ある人が借りている金額 @ja-jp
note: nessuno
in scheme: subjectcode
created: 2003-04-05T12:00:00+00:00
modified: 2012-07-10T12:00:00+00:00
broader: http://cv.iptc.org/newscodes/subjectcode/04008000