Mercati finanziari
type: Concept
preferred label: Finanzmarkt @de
preferred label: mercado financeiro @pt-pt
preferred label: 金融市場 @ja-jp
preferred label: financial markets @en-gb
preferred label: mercado financiero @es
preferred label: Marchés financiers @fr
definition: Instituições estabelecidas para negociar ações, ou outros títulos financeiros, de empresas ou organizações, podendo também incluir a comercialização de divisas. @pt-br
definition: Mercati dove vengono negoziati titoli e altri documenti finanziari di compagnie o altre società, che possono anche includere il commercio di valute
definition: Institutionen, die mit Anteilen oder anderen Finanzpapieren von Unternehmen oder anderen Organisationen handeln, kann auch Währungsgeschäfte beinhalten. @de
definition: Les marchés financiers où s'échangent les actions des sociétés côtées en bourse @fr
definition: 企業もしくは組織が発行する株式、あるいは他の有価証券を売買するために制定された制度(市場)。通貨取引を含ませることができる @ja-jp
definition: Institutions set up to trade the shares or other financial paper of companies or other organizations, can also include currency trading @en-gb
definition: Instituciones que negocian acciones o cualquier otro titulo de valor de compañías u organizaciones, puedan también incluir el intercambio de divisas. @es
note: nessuno
in scheme: subjectcode
created: 2003-04-05T12:00:00+00:00
modified: 2012-07-10T12:00:00+00:00
broader: http://cv.iptc.org/newscodes/subjectcode/04008000