Investimenti
type: Concept
preferred label: investimentos @pt-pt
preferred label: 投機 @ja-jp
preferred label: Investition @de
preferred label: investments @en-gb
preferred label: Investissements @fr
preferred label: inversiones @es
definition: Compra especulativa de instrumentos corporativos, matérias-primas, divisas, etc. @pt-pt
definition: Acquisti a fini speculativi di strumenti societari, materie prime, valute o parti di essi
definition: Spekulative Käufe von kollektiven Maschinen, Rohstoffen, Währungen oder Teilen davon. @de
definition: Speculative purchases of corporate instruments, of commodities, currencies, or parts thereof @en-gb
definition: Les investissements spéculatifs @fr
definition: Especulativa compra de instrumentos empresariales como materias primas, divisas, etc. @es
definition: 企業の器材、商品、通貨などを投機的に購入すること @ja-jp
note: nessuno
in scheme: subjectcode
created: 2003-04-05T12:00:00+00:00
modified: 2012-07-10T12:00:00+00:00
broader: http://cv.iptc.org/newscodes/subjectcode/04008000