Azioni
type: Concept
preferred label: Aktien @de
preferred label: ações @pt-pt
preferred label: 株式 @ja-jp
preferred label: acciones @es
preferred label: stocks @en-gb
preferred label: Parts de société @fr
definition: Documento empresarial que otorga a un individuo un derechos de propiedad a una determinada parte de las ganancias de una empresa. @es
definition: Les parts de société @fr
definition: Certificati che rappresentano una quota di capitale sociale di una spa e danno fra l'altro al proprietario il diritto ad una quota degli utili
definition: Documento empresarial que outorga a um indivíduo os direitos de propriedade de uma determinada parte dos ganhos de uma empresa. @pt-br
definition: Corporate paper that gives an individual an ownership right to a part of a company's earnings @en-gb
definition: Firmenpapier, das einer Einzelperson das Eigentumsrecht auf einen Gewinnanteil verleiht. @de
definition: 企業の所得の一部に個人的な所有権を与える、企業が発行する有価証券 @ja-jp
note: nessuno
in scheme: subjectcode
created: 2003-04-05T12:00:00+00:00
modified: 2012-07-10T12:00:00+00:00
broader: http://cv.iptc.org/newscodes/subjectcode/04008000