Fondi mutuabili
type: Concept
preferred label: Fonds d'investissement @fr
preferred label: 投資信託 @ja-jp
preferred label: Investmentfonds @de
preferred label: fundos de investimento @pt-br
preferred label: mutual funds @en-gb
preferred label: fondos mutuales @es
definition: 成長性、収益性、安全性などを考慮した株式もしくは債券、あるいはこれらの組み合わせに対する共同出資。日本では「mutual fund(ミューチュアルファンド)」は会社型投資信託の意 @ja-jp
definition: Pools von Anteilen oder festverzinslichen Wertpapieren zum Verkauf, oft gesammelt mit Investitionsabsicht in Wachstum, Einkommen oder Sicherheit. @de
definition: Fonds mutuels d'investissement, paniers d'actions où d'obligations @fr
definition: Fondo de acciones o bonos a la venta generalmente agrupadas por la intención de invertir, tal como crecimiento de ingreso y seguridad. @es
definition: Capitali a disposizione per essere prestati, spesso raggruppati per un investimento; Fondi d'Investimento
definition: Fundo de ações ou obrigações para venda agrupadas por intenção de investimento, tal como crescimento de rendimento ou segurança. @pt-br
definition: Pools of shares or bonds for sale often grouped by investment intention, such as growth, income or security @en-gb
note: nessuno
in scheme: subjectcode
created: 2003-04-05T12:00:00+00:00
modified: 2012-07-10T12:00:00+00:00
broader: http://cv.iptc.org/newscodes/subjectcode/04008000