Importazioni
type: Concept
preferred label: importações @pt-pt
preferred label: importaciones @es
preferred label: Import @de
preferred label: 輸入 @ja-jp
preferred label: imports @en-gb
preferred label: Importations @fr
definition: Alles was im Ausland erworben und zum Wiederverkauf ins Land gebraucht wurde. @de
definition: What is bought abroad and brought into a country for resale @en-gb
definition: Beni e servizi comprati all'estero per poi essere commercializzati in un paese
definition: Aquilo que é comprado no estrangeiro e que é trazido para um país para ser revendido. @pt-pt
definition: 外国で買い付け、国内で再販すること @ja-jp
definition: Es lo que se compra y se trae el país para volverlo a vender. @es
definition: Les biens et services achetés à l'étranger pour être commercialisés dans un pays @fr
note: nessuno
in scheme: subjectcode
created: 2003-04-05T12:00:00+00:00
modified: 2012-07-10T12:00:00+00:00
broader: http://cv.iptc.org/newscodes/subjectcode/04008000